социальный баланс
type: Concept
preferred label: bilan social @fr
preferred label: company's social costs @en
preferred label: Sozialbilanz @de
related: социальный бюджет <1>

социальный бюджет <1>
type: Concept
broad match: cl 3.1.00
in scheme: Thesaurus for the Social Sciences (TheSoz)
preferred label: budget social @fr
preferred label: Sozialbudget @en
related: социальный баланс
scope note: Die zahlenmäßige Zusammenstellung von Struktur, Entwicklung und Finanzierung der Sozialleistungen staatlicher Einrichtungen, öffentlich-rechtlicher Körperschaften und privatwirtschaftlicher Betriebe in kurz- und mittelfristiger Vorausschau @de
top concept of: Thesaurus for the Social Sciences (TheSoz)
pref label: социальный бюджет <1>
pref label: budget social
pref label: Sozialbudget

Thesaurus for the Social Sciences (TheSoz)
type: ConceptScheme

Sozialbudget
type: Label
broad match: cl 3.1.00

Sozialbudget
type: Label
broad match: cl 3.1.00
scope note: social budget, compilation of structure, development and financing of social services from public institutions @en

budget social
type: Label
broad match: cl 3.1.00

социальный бюджет <1>
type: Label
broad match: cl 3.1.00
scope note: социальные платежи государства, работодателей и публично-правовых организаций